{"text_format":"1","workbook":"xlsx","n_sheets":9,"sheets":["PartA","PartB","Director Attestation","FDC Instructions","Common Findings","Definitions","ExportA","ExportB","Drop-down"],"not_rendered":{"charts":0,"images":0,"macros":1,"external_links":0,"defined_names":2,"comments":0,"pivot_tables":0},"unopened":[],"bounds":{"document_bytes":16777216,"sheet_cells":100000,"rows_first":2000,"rows_last":500,"rows_between":2000,"halvings":0,"cell_chars":16384,"cell_head_chars":4096},"cells_cut":0,"cells_raw":0,"read":"whole","date_system":"1900"}

{"sheet":"PartA","index":0,"n_rows":906,"n_cols":4,"rows_kept":906,"cut":false,"hidden":false,"merged":[[847,3,848,3],[849,3,854,3],[855,3,857,3],[859,3,864,3],[865,3,867,3],[822,3,823,3],[824,3,831,3],[903,3,904,3],[884,3,887,3],[888,3,889,3],[894,1,894,3],[895,3,898,3],[899,3,900,3],[901,3,902,3],[868,3,870,3],[871,3,876,3],[877,3,879,3],[880,3,883,3],[890,1,891,3],[833,3,839,3],[840,3,841,3],[842,3,846,3],[799,3,800,3],[801,3,807,3],[808,3,810,3],[812,3,814,3],[815,3,816,3],[817,3,821,3],[792,1,793,3],[796,1,796,3],[797,1,798,3],[779,3,780,3],[782,3,785,3],[787,3,788,3],[765,3,766,3],[767,3,768,3],[752,3,753,3],[754,3,757,3],[744,2,745,3],[735,3,736,3],[737,3,738,3],[729,3,731,3],[739,3,741,3],[689,2,689,3],[691,3,692,3],[694,2,694,3],[681,3,682,3],[684,2,684,3],[686,3,687,3],[673,3,674,3],[718,3,719,3],[722,3,723,3],[724,3,727,3],[709,3,710,3],[714,3,715,3],[695,3,696,3],[697,3,698,3],[700,3,701,3],[703,3,707,3],[658,3,659,3],[668,3,670,3],[678,3,679,3],[654,3,655,3],[662,3,663,3],[647,3,648,3],[636,3,638,3],[619,3,620,3],[623,3,624,3],[626,3,627,3],[608,3,610,3],[612,1,613,3],[616,1,616,3],[617,3,618,3],[630,3,634,3],[640,3,641,3],[643,3,645,3],[651,3,652,3],[601,3,603,3],[605,3,606,3],[592,3,593,3],[595,2,596,3],[584,3,586,3],[588,3,590,3],[575,3,576,3],[578,2,579,3],[564,2,565,3],[570,3,573,3],[500,2,500,3],[506,3,510,3],[487,3,488,3],[477,3,478,3],[558,3,560,3],[561,3,563,3],[539,3,542,3],[544,3,546,3],[527,3,529,3],[531,3,533,3],[535,3,536,3],[547,3,549,3],[550,3,553,3],[555,3,556,3],[501,3,503,3],[513,3,516,3],[519,3,522,3],[523,3,524,3],[467,3,468,3],[437,3,438,3],[440,2,441,3],[443,3,444,3],[445,3,446,3],[431,3,432,3],[434,2,435,3],[448,3,451,3],[454,3,456,3],[420,2,420,3],[421,3,422,3],[423,3,424,3],[427,2,427,3],[407,3,408,3],[409,3,410,3],[417,3,418,3],[399,2,399,3],[400,3,402,3],[404,3,406,3],[411,3,415,3],[425,3,426,3],[313,3,317,3],[353,3,354,3],[389,3,390,3],[395,3,396,3],[380,2,380,3],[383,3,384,3],[374,2,374,3],[376,3,378,3],[361,3,364,3],[366,2,366,3],[368,2,368,3],[350,3,351,3],[356,1,357,3],[360,1,360,3],[348,3,349,3],[372,3,373,3],[392,3,394,3],[386,3,387,3],[319,3,325,3],[328,3,330,3],[333,3,334,3],[337,3,340,3],[343,3,346,3],[304,3,306,3],[287,3,290,3],[298,3,299,3],[278,2,279,3],[280,3,281,3],[283,3,285,3],[273,3,276,3],[292,3,296,3],[308,3,311,3],[271,3,272,3],[245,3,248,3],[249,3,250,3],[233,3,236,3],[237,3,238,3],[226,3,232,3],[239,3,243,3],[252,3,257,3],[264,3,267,3],[259,3,263,3],[218,2,218,3],[219,2,220,3],[192,3,193,3],[196,3,197,3],[199,3,203,3],[181,3,183,3],[171,2,171,3],[172,3,173,3],[174,3,175,3],[204,3,207,3],[209,3,215,3],[164,3,165,3],[152,3,153,3],[158,1,158,3],[159,3,161,3],[139,3,141,3],[143,3,145,3],[147,3,148,3],[136,3,137,3],[131,3,133,3],[155,1,156,3],[65,1,65,3],[66,3,67,3],[51,3,52,3],[62,1,63,3],[54,3,56,3],[58,3,59,3],[73,3,76,3],[81,3,83,3],[905,1,906,3],[91,3,93,3],[72,2,72,3],[78,3,79,3],[221,3,223,3],[85,3,89,3],[117,3,121,3],[123,3,125,3],[127,2,127,3],[128,3,129,3],[106,3,109,3],[111,2,111,3],[112,3,115,3],[95,3,96,3],[98,3,99,3],[101,3,104,3],[6,1,7,3],[9,1,9,3],[11,1,11,3],[12,1,12,3],[1,1,1,2],[2,1,2,2],[3,1,3,2],[4,1,4,2],[48,3,49,3],[30,3,32,3],[23,3,24,3],[26,2,26,3],[27,3,28,3],[13,1,13,3],[14,3,17,3],[20,2,20,3],[36,3,38,3],[41,3,42,3],[33,3,34,3]]}
[]
[null,"Date:"]
[null,"Facility:",null,"Select Facility…"]
[null,"Facility Contact for Questions:"]
[null,"Facility Contact Email:"]
[]
[null,"Submission of this form should occur no later than August 16, 2024.  If updated information becomes available after August 16, 2024, please contact ORO at VHACOOROEDA@va.gov. "]
[]
[]
[null,"PART A - CHECKLIST OF RESEARCH - RELATED REQUIREMENTS"]
[]
[null,"Medical Facility Director - Institutional Responsibilities"]
[null,"Questions shaded in yellow are new questions from previous FDC versions."]
[null,"Questions related to Common Findings on ORO Combined Program Reviews will include an \"ORO Common Finding\" button. Clicking on the button for these items will navigate to the relevant section on ORO's Common Findings List."]
[null,"1.","Select…","Are there adequate resources and administrative support, including personnel, space, equipment, and training for the Research and Development Committee (R&DC) and its subcommittees to fulfill their responsibilities? \nVHA Directive 1200.01(1) §5.f(6); VHA Directive 1200.02(1) §11.e(2)-(3)"]
{"$rows_left_out":892}
{"sheet":"PartB","index":1,"n_rows":614,"n_cols":4,"rows_kept":614,"cut":false,"hidden":false,"merged":[[7,2,9,2],[8,3,11,3],[10,2,11,2],[12,2,13,2],[13,3,17,3],[14,2,16,2],[0,1,0,3],[1,1,1,3],[2,1,2,2],[3,1,3,3],[4,1,4,3],[5,1,6,3],[37,2,39,2],[37,3,39,3],[40,2,41,2],[42,2,43,2],[42,3,43,3],[44,2,45,2],[18,1,18,3],[21,1,21,3],[22,1,23,3],[24,2,25,2],[26,2,28,2],[26,3,31,3],[69,2,70,2],[71,2,73,2],[74,2,75,2],[78,1,78,3],[79,1,79,3],[80,1,84,3],[50,2,53,2],[51,3,59,3],[54,2,55,2],[56,2,58,2],[60,2,61,2],[61,3,68,3],[62,2,65,2],[66,2,67,2],[104,2,105,2],[106,2,107,2],[108,2,109,2],[110,2,111,2],[113,2,114,2],[115,2,116,2],[87,2,88,2],[87,3,88,3],[91,2,92,2],[97,2,98,2],[99,2,100,2],[101,2,102,2],[130,2,132,2],[130,3,136,3],[133,2,135,2],[142,3,146,3],[143,2,145,2],[147,2,148,2],[117,2,118,2],[119,2,120,2],[123,2,124,2],[123,3,124,3],[126,2,128,2],[126,3,128,3],[169,2,171,2],[171,3,176,3],[173,2,175,2],[177,2,178,2],[178,3,182,3],[179,2,182,2],[149,3,153,3],[150,2,152,2],[161,2,162,2],[164,2,165,2],[165,3,167,3],[166,2,167,2],[198,1,198,3],[199,2,200,2],[202,2,203,2],[203,3,206,3],[204,2,205,2],[207,2,208,2],[183,2,184,2],[185,2,186,2],[185,3,186,3],[190,2,193,2],[194,1,194,3],[197,1,197,3],[236,2,237,2],[237,3,241,3],[238,2,240,2],[243,2,244,2],[245,2,247,2],[245,3,248,3],[217,2,218,2],[220,2,221,2],[223,2,225,2],[223,3,226,3],[227,2,228,2],[229,2,230,2],[230,3,234,3],[231,2,233,2],[261,2,262,2],[267,2,268,2],[267,3,272,3],[269,2,271,2],[276,3,280,3],[277,2,279,2],[249,2,250,2],[251,2,252,2],[253,2,254,2],[255,2,256,2],[257,2,258,2],[259,2,260,2],[295,2,296,2],[297,2,299,2],[302,2,303,2],[304,2,305,2],[306,2,308,2],[306,3,309,3],[281,2,282,2],[282,3,288,3],[283,2,284,2],[285,2,287,2],[289,2,290,2],[290,3,292,3],[291,2,292,2],[321,2,322,2],[321,3,326,3],[323,2,325,2],[327,2,328,2],[328,3,333,3],[329,2,330,2],[331,2,332,2],[310,2,311,2],[311,3,312,3],[313,2,314,2],[315,2,316,2],[318,2,319,2],[318,3,319,3],[347,2,348,2],[348,3,354,3],[349,2,350,2],[351,2,353,2],[355,2,356,2],[357,2,358,2],[358,3,359,3],[334,2,337,2],[335,3,337,3],[338,2,340,2],[339,3,342,3],[341,2,342,2],[343,2,344,2],[344,3,346,3],[345,2,346,2],[376,2,377,2],[377,3,380,3],[378,2,380,2],[381,2,382,2],[382,3,388,3],[383,2,384,2],[385,2,387,2],[361,3,365,3],[362,2,364,2],[366,2,367,2],[367,3,368,3],[370,2,371,2],[370,3,375,3],[372,2,374,2],[397,1,397,3],[398,1,398,3],[399,1,400,3],[401,2,402,2],[403,2,405,2],[404,3,409,3],[406,2,408,2],[389,2,390,2],[390,3,392,3],[391,2,392,2],[393,1,393,3],[395,1,395,2],[396,1,396,3],[421,2,422,2],[423,2,424,2],[425,2,426,2],[427,2,428,2],[431,2,432,2],[435,2,436,2],[410,2,411,2],[411,3,417,3],[412,2,414,2],[415,2,416,2],[419,1,419,3],[420,1,420,3],[450,2,451,2],[450,3,451,3],[460,2,463,2],[460,3,464,3],[467,2,469,2],[470,2,471,2],[471,3,477,3],[473,2,476,2],[436,3,441,3],[437,2,438,2],[439,2,440,2],[443,2,445,2],[443,3,449,3],[446,2,448,2],[491,1,491,3],[493,1,493,2],[494,1,494,3],[495,1,496,3],[497,1,498,3],[499,2,500,2],[478,2,479,2],[480,2,481,2],[481,3,482,3],[483,2,484,2],[485,2,486,2],[486,3,490,3],[487,2,489,2],[521,1,521,3],[523,2,524,2],[525,2,526,2],[527,2,528,2],[532,2,534,2],[535,2,536,2],[501,2,502,2],[503,2,506,2],[504,3,510,3],[507,2,509,2],[511,2,512,2],[512,3,519,3],[513,2,515,2],[516,2,518,2],[552,3,554,3],[553,2,554,2],[555,2,557,2],[560,2,561,2],[561,3,563,3],[562,2,563,2],[537,2,538,2],[539,2,540,2],[542,2,543,2],[544,2,545,2],[546,2,548,2],[551,2,552,2],[583,2,584,2],[585,2,586,2],[587,2,588,2],[592,2,593,2],[592,3,598,3],[594,2,597,2],[564,1,566,1],[564,2,565,2],[569,2,570,2],[570,3,571,3],[571,2,572,2],[578,2,581,2],[578,3,582,3],[613,1,613,3],[599,2,600,2],[601,2,602,2],[602,3,603,3],[603,2,604,2],[605,2,606,2],[607,2,608,2],[608,3,612,3],[609,2,611,2]]}
[]
[null,"PART B – RESEARCH PROGRAM QUANTITATIVE DATA"]
[]
[null,"RESEARCH AND DEVELOPMENT PROGRAM AND R&DC"]
[null,"Note: Questions shaded in yellow are new questions from previous FDC versions."]
[null,"Note: Questions #1 to 1a are not based on RCO audits and pertain only to events occurring during the current reporting period. These questions may be best addressed by the Research Service."]
[]
[null,"1. ","Number of protocols followed only by the R&DC at any time during this reporting period (e.g., IRB-exempt human subjects protocols; protocols without human, animal, or safety hazards not followed by any research subcommittee):"]
[]
[]
[null,null,"Only include protocols that are solely followed by the R&DC and not followed by any other oversight committee (including any external committees)."]
[]
[null,null,"a.  Number in #1 that were NOT initially approved by the R&DC before research was initiated:"]
[]
[null,null,"Note: For answers greater than zero for item #1a, use the text box below to provide specific details (e.g., whether reported to a review board, board's determination, etc.) or to provide the ORO case number(s) if previously reported to ORO."]
{"$rows_left_out":600}
{"sheet":"Director Attestation","index":2,"n_rows":18,"n_cols":1,"rows_kept":18,"cut":false,"hidden":false,"merged":[[0,0,0,9],[2,0,2,2],[3,0,4,9],[6,0,7,9],[17,0,17,3],[17,4,17,9],[13,0,14,9],[9,0,9,9],[10,0,10,9],[11,0,11,9],[12,0,12,9],[1,0,1,9]]}
[{"$f":"PartA!D3","v":"Select Facility…"}]
["Facility Director Attestation"]
[]
["I acknowledge that I am the Director of this VHA Facility and the Institutional Official responsible for this Facility’s compliance with all federal, VA, and VHA research requirements.  "]
[]
[]
["By submitting this document, I certify that the information contained in this document is accurate to the best of my knowledge."]
[]
[]
["Complete the following steps to submit this Certification:"]
["1. Type your name in the \"Name of the Medical Facility Director\" text box highlighted below."]
["2. Save the file by clicking the \"Save File\" button below."]
["3. Click the \"Email File\" button to attach this file to an email."]
["4. In the subject line or body of the email, please include your facility's station number and/or facility name and send the email."]
[]
{"$rows_left_out":4}
{"sheet":"FDC Instructions","index":3,"n_rows":119,"n_cols":1,"rows_kept":119,"cut":false,"hidden":false,"merged":[[15,0,16,9],[2,0,3,9],[5,0,5,9],[7,0,8,9],[10,0,10,9],[12,0,13,9],[67,0,70,9],[18,0,18,9],[24,0,24,9],[26,0,27,9],[29,0,29,9],[36,0,44,9],[46,0,50,9],[52,0,55,9],[57,0,61,9],[63,0,65,9],[20,0,22,9],[33,0,34,9],[118,0,118,9],[72,0,73,9],[83,0,87,9],[89,0,92,9],[94,0,95,9],[97,0,98,9],[100,0,102,9],[106,0,106,9],[108,0,109,9],[111,0,112,9],[114,0,114,9],[77,0,81,9]]}
["GENERAL INSTRUCTIONS"]
[]
["1. Complete and submit the 2024 Facility Director’s Certification of Research Oversight (FDC) in MS Excel format.  "]
[]
[]
["2. Open the Excel tool in the MS Excel application. Do not open the tool through MS Teams or OneDrive."]
[]
["3. Save the tool as a macro-enabled workbook (.xlsm) so all functions work as intended. The tool has built-in logic to gray out certain questions and rows depending on the answers to other questions. "]
[]
[]
["4. Include your facility's name in the file name of the saved document."]
[]
["5. Adjust how zoomed in or out you are on the screen as needed if an item appears to be truncated. All items are formatted to be fully visible, but appearances may differ by screen. "]
[]
[]
{"$rows_left_out":105}
{"sheet":"Common Findings","index":4,"n_rows":330,"n_cols":3,"rows_kept":330,"cut":false,"hidden":false,"merged":[]}
[]
[null,"The Common Findings Tab lists recurring findings of programmatic noncompliance captured in ORO combined program review (CPR) reports issued in calendar years 2021 through 2023. \"Common Findings\" are those findings identified at 20% or more of the programs reviewed across the combined 3-year period (2021-2023). The numbered items (shaded in orange) list the Common Findings. The bulleted points below each listed Common Finding provide representative examples of that finding from the CPR reports. Red font denotes that the description of the finding aligns with a specific question on the FDC. \n\nIn the Part A Tab, FDC items related to a Common Findings are shaded in pink to provide information about which FDC questions correspond with the Common Findings. Information about the Common Findings from CPRs has been added to the FDC to bring awareness to the nature of the noncompliance ORO regularly finds during site visits. By raising awareness of these Common Findings, ORO hopes to try to reduce the occurrence of that noncompliance.\n","←RETURN"]
[]
[null,"Common Findings Related to General Research Administration"]
[null,"1. Deficient or No Tracking of Research Activities"]
[null,"• The Research Office did not have a system for tracking research studies and committee actions.","←RETURN"]
[null,"• The Research Office did not meet the requirement to establish tracking systems that allowed for easy retrieval of information to assist in assessing compliance with applicable requirements and the status of each program activity or element. "]
[null,"• The Research Office tracking systems did not include initial and continuing review approvals given by the SRS and the inventory of research data did not contain all required information, such as where the data are stored.","←RETURN"]
[null,"• The Research Office tracking systems contained inaccuracies and thus did not allow for the easy retrieval of information. "]
[null,"• The Research Office’s inventory of all research data being stored until the retention requirement has been met was incomplete. ","←RETURN"]
[null,"• The Research Office tracking system for the training of research personnel contained inaccuracies and deficiencies.  "]
[null,"• The Research Office did not consistently use its tracking systems to assess compliance with the completion of all ORD-required training for research personnel and Annual Government Ethics training for investigators. ","←RETURN"]
[null,"• The RCO maintained responsibility for tracking the completion of an educational requirement for research personnel and investigators, although VHA policy requires that the Research Office maintain responsibility for this tracking function. "]
[null,"2. Deficient R&DC Meeting Minutes"]
[null,"• The R&DC meeting minutes did not include a list of all voting members."]
{"$rows_left_out":316}
{"sheet":"Definitions","index":5,"n_rows":7,"n_cols":1,"rows_kept":7,"cut":false,"hidden":false,"merged":[]}
["DEFINITIONS"]
["TYPES OF INSTITUTIONAL ANIMAL CARE AND USE COMMITTEES "]
["Internal VA-Appointed Institutional Animal Care and Use Committee. Such an IACUC oversees research for a VA program that has a VMU and its own PHS Assurance, and is described in that Assurance. This type of IACUC is a subcommittee of the R&D Committee."]
[]
["External Jointly-Appointed Institutional Animal Care and Use Committee. Such an IACUC oversees research with animals for a VA program that has a VMU and its own PHS Assurance, but for which the VA medical facility and the affiliate agree to share a single set of IACUC members, administered by the affiliate. The written agreement establishing this arrangement identifies the specific procedures that each party requires to meet its regulatory responsibilities, and commits both parties reciprocally to accommodating those procedures. The members are each appointed to two IACUCs, with each IACUC described in its own PHS Assurance: the affiliate’s IACUC (described in the affiliate’s PHS Assurance, with members appointed by the affiliate’s CEO) and the VA’s external jointly-appointed IACUC (described in the VA’s PHS Assurance, with members appointed by the VA medical facility Director). "]
[]
["External Affiliate-Appointed Institutional Animal Care and Use Committee. Such an IACUC oversees research for a VA program that does not have its own PHS Assurance, either by choice or because it does not have a VMU and is therefore not eligible to have an Assurance. The IACUC is the one described in the affiliate’s PHS Assurance. The written agreement establishing this arrangement identifies the specifics of what VA requires for the VA animal research program to meet its regulatory responsibilities, and the specifics of what the VA is required to provide for the affiliate’s IACUC to be able to oversee the VA program. Both parties commit to those specifics."]

{"sheet":"ExportA","index":6,"n_rows":261,"n_cols":8,"rows_kept":261,"cut":false,"hidden":true,"merged":[]}
["Question#","QuestionText","id-facility","id-question","FDCdate","FDCresult",null,"Cells formatted as dates are highlighted in bright blue"]
["1","Adequate Resources",{"$f":"IF(PartA!D3=\"\",\"\",PartA!D3)","v":"Select Facility…"},"FD2","2024-07-31",{"$f":"IF(PartA!C15=\"\",\"\",PartA!C15)","v":"Select…"}]
["1_detail","DETAILS Adequate Resources",{"$f":"C2","v":"Select Facility…"},"FD20","2024-07-31",{"$f":"IF(PartA!D20=\"\",\"\",PartA!D20)","v":""}]
["2a","R&DC Appointed in Writing",{"$f":"C3","v":"Select Facility…"},"FD9","2024-07-31",{"$f":"IF(PartA!C22=\"\",\"\",PartA!C22)","v":"Select…"}]
["2b","Delegated Roles","Select Facility…","FD1","2024-07-31",{"$f":"IF(PartA!C24=\"\",\"\",PartA!C24)","v":"Select…"}]
["3a","RCO Audit Plan","Select Facility…","FD6","2024-07-31",{"$f":"IF(PartA!C28=\"\",\"\",PartA!C28)","v":"Select…"}]
["3b","Audits Completed","Select Facility…","FD7","2024-07-31",{"$f":"IF(PartA!C31=\"\",\"\",PartA!C31)","v":"Select…"}]
["3b_detail","DETAILS Audits Not Completed","Select Facility…","FD11","2024-07-31",{"$f":"IF(PartA!D36=\"\",\"\",PartA!D36)","v":""}]
["4","Any Acting Position(s)","Select Facility…","FD3","2024-07-31",{"$f":"IF(PartA!C37=\"\",\"\",PartA!C37)","v":"Select…"}]
["4_FD","Acting Facility Director","Select Facility…","FD12","2024-07-31",{"$f":"IF(PartA!C41=\"\",\"\",PartA!C41)","v":"Select…"}]
["4_ACOS","Acting ACOS/Research or Coordinator","Select Facility…","FD14","2024-07-31",{"$f":"IF(PartA!C42=\"\",\"\",PartA!C42)","v":"Select…"}]
["4_AO","Acting Administrative Officer/Research","Select Facility…","FD15","2024-07-31",{"$f":"IF(PartA!C44=\"\",\"\",PartA!C44)","v":"Select…"}]
["4_RCO","Acting Research Compliance Officer","Select Facility…","FD16","2024-07-31",{"$f":"IF(PartA!C45=\"\",\"\",PartA!C45)","v":"Select…"}]
["4_CC","Acting Research Committee Coordinator(s)","Select Facility…","FD17","2024-07-31",{"$f":"IF(PartA!C46=\"\",\"\",PartA!C46)","v":"Select…"}]
["4_CC_detail","Acting Committee Coordinator details","Select Facility…","FD18","2024-07-31",{"$f":"IF(PartA!D48=\"\",\"\",PartA!D48)","v":""}]
{"$rows_left_out":247}
{"sheet":"ExportB","index":7,"n_rows":191,"n_cols":10,"rows_kept":191,"cut":false,"hidden":true,"merged":[]}
["Question#","QuestionText","id-facility","id-question","ROC_QuestionKey","FDCdate","FDCresult","FDCdetail"]
["1","Total number of protocols followed by the R&DC only",{"$f":"IF(PartA!D3=\"\",\"\",PartA!D3)","v":"Select Facility…"},1,"R1","2024-07-31",{"$f":"IF(PartB!D8=\"\",\"\",PartB!D8)","v":""}]
["1a","Protocols initiated prior to R&DC approval",{"$f":"C2","v":"Select Facility…"},2,"R2","2024-07-31",{"$f":"IF(PartB!D13=\"\",\"\",PartB!D13)","v":""}]
["1aDetails","DETAILS Protocols initiated prior to R&DC approval","Select Facility…",147,"R5","2024-07-31",null,{"$f":"IF(PartB!C18=\"\",\"\",PartB!C18)","v":""}]
["R&DCSectionNotes","DETAILS R&DC Section Notes","Select Facility…",295,"R7","2024-07-31",null,{"$f":"IF(PartB!C20=\"\",\"\",PartB!C20)","v":""}]
["2","Active human protocols","Select Facility…",5,"H1","2024-07-31",{"$f":"IF(PartB!D25=\"\",\"\",PartB!D25)","v":""}]
["MVP","DETAILS MVP active at site","Select Facility…",155,"H82","2024-07-31",null,false]
["AllOfUs","DETAILS All of Us active at site","Select Facility…",187,"H123","2024-07-31",null,false]
["3a","IRB-exempt human subjects protocols","Select Facility…",6,"H2","2024-07-31",{"$f":"IF(PartB!D33=\"\",\"\",PartB!D33)","v":""}]
["3b","Non-exempt human subjects protocols","Select Facility…",7,"H3","2024-07-31",{"$f":"IF(PartB!D34=\"\",\"\",PartB!D34)","v":""}]
["4a","Protocols with waivers of informed consent per 38CFR16.116","Select Facility…",9,"H5","2024-07-31",{"$f":"IF(PartB!D37=\"\",\"\",PartB!D37)","v":""}]
["4b","Protocols with waiver of documentation of informed consent per 38CFR16.117(c)","Select Facility…",8,"H4","2024-07-31",{"$f":"IF(PartB!D41=\"\",\"\",PartB!D41)","v":""}]
[5,"Greater than minimal risk protocols","Select Facility…",129,"H72","2024-07-31",{"$f":"IF(PartB!D45=\"\",\"\",PartB!D45)","v":""}]
["6a","Protocols subject to 2018 Common Rule","Select Facility…",249,"H146","2024-07-31",{"$f":"IF(PartB!D48=\"\",\"\",PartB!D48)","v":""}]
["6b","Protocols subject to Pre-2018 Common Rule","Select Facility…",250,"H147","2024-07-31",{"$f":"IF(PartB!D49=\"\",\"\",PartB!D49)","v":""}]
{"$rows_left_out":177}
{"sheet":"Drop-down","index":8,"n_rows":110,"n_cols":34,"rows_kept":110,"cut":false,"hidden":true,"merged":[[23,32,23,33],[24,32,25,33]]}
["VISN","Facility #","Facility","Select Facility…",null,"Select…",null,"Select…",null,"Select…",null,"Select…",null,"Select…",null,"Select…",null,"Select…",null,"Select…",null,"Select…",null,"Select…",null,"Select…",null,"Select…"]
[1,402,"VA Maine Healthcare System - Togus","402 VA Maine Healthcare System - Togus",null,"Yes",null,"Yes",null,"Continued full accreditation",null,"VA registration",null,"Only at the VA VMU (owned or leased)",null,"The VA ACUP is covered by a VA PHS Assurance",null,"VA-maintained accreditation",null,"The VA IACUC performs the program review and facility inspection of the VA animal program.",null,"The VA IACUC performs its own program review and facility inspection of the affiliate(s) animal program.",null,0,null,"The IBC is a separate committee from the SRS. ",null,"Internal VA-appointed IACUC-of record"]
[1,405,"White River Junction VA Medical Center","405 White River Junction VA Medical Center",null,"No",null,"No",null,"Conditional accreditation",null,"Affiliate registration",null,"Both VA VMU (owned or leased) and affiliate",null,"The VA ACUP is covered by the affiliate's PHS Assurance",null,"Affiliate-maintained accreditation",null,"The affiliate IACUC-of-record (i.e., no VA IACUC) performs the program review and facility inspection of the VA animal program.",null,"The VA IACUC accepts the semi-annual reports of the affiliate IACUC (in lieu of performing its own facility inspection and program review) as a business item during a convened meeting.",null,"1-10",null,"The SRS is constituted as an IBC, and convenes as an IBC/SRS (a single set of minutes are produced).",null,"External affiliate-appointed IACUC-of-record"]
[23,437,"Fargo VA Health Care System","437 Fargo VA Health Care System",null,"N/A",null,null,null,"Deferred accreditation",null,"No registration",null,"Only at the affiliate",null,null,null,null,null,null,null,"The affiliate IACUC-of-record (i.e., no VA IACUC) performs the program review and facility inspection of the VA animal program.",null,"11-20",null,"The SRS is constituted as an IBC, but separate IBC and SRS meetings are convened (two sets of minutes are produced).",null,"External jointly-appointed IACUC-of-record"]
[23,438,"Sioux Falls VA Health Care System","438 Sioux Falls VA Health Care System",null,null,null,null,null,"Probation",null,null,null,null,null,null,null,null,null,null,null,null,null,"21-30"]
[21,459,"VA Pacific Islands Health Care System","459 VA Pacific Islands Health Care System",null,null,null,null,null,"Revoked accreditation",null,null,null,null,null,null,null,null,null,null,null,null,null,"31-40"]
[4,460,"Wilmington VA Medical Center","460 Wilmington VA Medical Center",null,null,null,null,null,null,null,null,null,null,null,null,null,null,null,null,null,null,null,">40"]
[22,501,"New Mexico VA Health Care System","501 New Mexico VA Health Care System"]
[10,506,"VA Ann Arbor Healthcare System","506 VA Ann Arbor Healthcare System"]
[7,508,"Atlanta VA Medical Center","508 Atlanta VA Medical Center"]
[7,509,"Charlie Norwood VA Medical Center","509 Charlie Norwood VA Medical Center"]
[5,512,"VA Maryland Health Care System","512 VA Maryland Health Care System"]
[10,515,"Battle Creek VA Medical Center","515 Battle Creek VA Medical Center"]
[8,516,"Bay Pines VA Healthcare System","516 Bay Pines VA Healthcare System"]
[1,518,"Edith Nourse Rogers Memorial VA Hospital","518 Edith Nourse Rogers Memorial VA Hospital"]
{"$rows_left_out":95}